{"text_format":"1","workbook":"xlsx","n_sheets":30,"sheets":["Sommaire","Applic1","Applic1_corrigé","Applic2_consignes","Applic2","Applic2_corrigé","Applic3","Applic3_corrigé","Applic4","Applic4_corrigé","Filtre1_corrigé","Filtre2_corrigé","Filtre3_corrigé","Filtre4_corrigé","FiltreElab1_corrigé","FiltreElab2_corrigé","FiltreElab3_corrigé","FiltreElab4_corrigé","FiltreElab5_corrigé","FiltreElab6_corrigé","Sous-Totaux1_corrigé","Sous-Totaux2_corrigé","Sous-Totaux3_corrigé","Fonctions classiques_corrigé","TCD1_corrigé","TCD2_corrigé","TCD3_corrigé","TCD4_corrigé","TCD5_corrigé","TCD6_corrigé"],"not_rendered":{"charts":1,"images":0,"macros":1,"external_links":0,"defined_names":31,"comments":1,"pivot_tables":6},"unopened":[],"bounds":{"document_bytes":16777216,"sheet_cells":100000,"rows_first":2000,"rows_last":500,"rows_between":2000,"halvings":0,"cell_chars":16384,"cell_head_chars":4096},"cells_cut":0,"cells_raw":0,"read":"whole","date_system":"1900"}

{"sheet":"Sommaire","index":0,"n_rows":11,"n_cols":5,"rows_kept":11,"cut":false,"hidden":false,"merged":[]}
[]
[]
[null,"Applic1","Références absolues, RECHERCHEV, SI",null,"Ci-contre, vous pouvez utiliser les liens hypertextes de façon à atteindre une application selon le thème précisé en colonne B."]
[null,null,null,null,"Sur chaque feuille est présenté l'exercice à réaliser. Un bouton 'Help' permet d'afficher la feuille contenant le corrigé."]
[null,"Applic2","SI, SI.CONDITIONS, RECHERCHEV",null,"Avant de commencer, masquer tous les corrigés en utilisant le bouton de la barre d'outils 'Employés'"]
[]
[null,"Applic3","RECHERCHEV par valeur proche",null,"Lors de la réalisation des exercices, nous effectuerons d'abord tous les calculs avant d'afficher le corrigé pour voir y voir les résolutions"]
[]
{"$rows_left_out":4}
{"sheet":"Applic1","index":1,"n_rows":23,"n_cols":12,"rows_kept":23,"cut":false,"hidden":false,"merged":[]}
["Titre","Référence de l'auteur","Prix","Prix avec réduction 1","Prix avec réduction 2","Nom de l'auteur","Prénom de l'auteur",null,null,null,"Retour sommaire"]
["Cartes sur table",13,10]
["Drame en trois actes",13,12,null,null,null,null,null,"1) Calculez le prix avec réduction (= prix - taux * prix ). Utilisez le taux se trouvant dans la cellule ci-dessous"]
["Contes",2,12]
["Dix petits nègres",13,15,null,null,null,null,null,"Taux : ",0.1]
["Café turc",5,12]
["Poétique",4,18,null,null,null,null,null,"2) Calculez un prix avec une réduction supplémentaire de 5% pour les livres qui coûtent 15 € ou plus"]
["La Main froide",12,12]
{"$rows_left_out":16}
{"sheet":"Applic1_corrigé","index":2,"n_rows":31,"n_cols":12,"rows_kept":31,"cut":false,"hidden":true,"merged":[]}
["Titre","Référence de l'auteur","Prix","Prix avec réduction 1","Prix avec réduction 2","Nom de l'auteur","Prénom de l'auteur"]
["Cartes sur table",13,10,{"$f":"C2-$J$5*C2","v":9},{"$f":"IF(C2>=15,D2-5%*D2,D2)","v":9},{"$f":"VLOOKUP(B2,$J$20:$L$31,2)","v":"Christie"},{"$f":"VLOOKUP(B2,$J$19:$L$31,3)","v":"Agatha"}]
["Drame en trois actes",13,12,{"$f":"C3-$J$5*C3","v":10.8},{"$f":"IF(C3>=15,D3-5%*D3,D3)","v":10.8},{"$f":"VLOOKUP(B3,$J$20:$L$31,2)","v":"Christie"},{"$f":"VLOOKUP(B3,$J$19:$L$31,3)","v":"Agatha"},null,"1) Calculez le prix avec réduction (= prix - taux * prix ). Utilisez le taux se trouvant dans la cellule ci-dessous"]
["Contes",2,12,10.8,10.8,"Andersen","Hans Christian"]
["Dix petits nègres",13,15,13.5,12.824999999999999,"Christie","Agatha",null,"Taux : ",0.1]
["Café turc",5,12,10.8,10.8,"Arjouni","Jakob"]
["Poétique",4,18,16.2,15.389999999999999,"Aristote","",null,"NB : Attention, la cellule du taux doit être en référence absolue ($J$5)"]
["La Main froide",12,12,10.8,10.8,"Brussolo","Serge"]
{"$rows_left_out":24}
{"sheet":"Applic2_consignes","index":3,"n_rows":37,"n_cols":13,"rows_kept":37,"cut":false,"hidden":false,"merged":[]}
[null,null,null,null,null,null,null,null,null,null,null,null,"Retour sommaire"]
[]
[null,"1) Ecrire 'Madame' ou 'Monsieur' selon le sexe de la personne "]
[]
[null,"NB : plusieurs fonctions seront utilisées pour réaliser l'exercice"]
[]
[]
[null,"2) Ecrire 'Madame', 'Mademoiselle' ou 'Monsieur' selon le sexe et l'état civil"]
{"$rows_left_out":30}
{"sheet":"Applic2","index":4,"n_rows":24,"n_cols":20,"rows_kept":24,"cut":false,"hidden":false,"merged":[]}
["Nom","Prénom","Sexe","Mme, Mr\n(*)\n(SI)","Mme, Mr\n(*)\n(SI.CONDITIONS)","Mme, Mr\n(*)\n(RECHERCHEV)","Etat civil","Mme, Mlle, Mr (**)\n(SI)","Mme, Mlle, Mr (**)\n(SI.Conditions)","CP","Ville","Date de naissance","Age","Catégorie\n(SI)\n(***)","Catégorie\n(SI.Conditions)\n(***)","Catégorie\n(RechercheV)\n(CF Applic3)","Services","Salaires",null,"Retour sommaire"]
["Bistrot","Alonso","m",null,null,null,"Marié(e)",null,null,1030,null,"1966-01-17",null,null,null,null,"Informatique"]
["Bijoba","Jo","m",null,null,null,"Marié(e)",null,null,1000,null,"1996-03-15",null,null,null,null,"Direction"]
["Covert","Harry","m",null,null,null,"Divorcé(e)",null,null,1000,null,"2000-02-10",null,null,null,null,"Personnel"]
["Culaire","Laury","m",null,null,null,"Marié(e)",null,null,1030,null,"1965-05-05",null,null,null,null,"Personnel"]
["Deuf","John","m",null,null,null,"Célibataire",null,null,1070,null,"1993-09-08",null,null,null,null,"Informatique"]
["Foupasune","Jean","m",null,null,null,"Célibataire",null,null,1070,null,"1975-08-07",null,null,null,null,"Personnel"]
["Lairbon","Oussama","m",null,null,null,"Marié(e)",null,null,1030,null,"1983-02-08",null,null,null,null,"Personnel"]
{"$rows_left_out":17}
{"sheet":"Applic2_corrigé","index":5,"n_rows":73,"n_cols":18,"rows_kept":73,"cut":false,"hidden":true,"merged":[]}
["Nom","Prénom","Sexe","Mme, Mr\n(*)\n(SI)","Mme, Mr\n(*)\n(SI.CONDITIONS)","Mme, Mr\n(*)\n(RECHERCHEV)","Etat civil","Mme, Mlle, Mr (**)\n(SI)","Mme, Mlle, Mr (**)\n(SI.Conditions)","CP","Ville","Date de naissance","Age","Catégorie\n(SI)\n(***)","Catégorie\n(SI.Conditions)\n(***)","Catégorie\n(RechercheV)\n(CF Applic3)","Services","Salaires"]
["Bistrot","Alonso","m",{"$f":"IF(C2=\"f\",\"Madame\",\"Monsieur\")","v":"Monsieur"},{"$f":"_xlfn.IFS(C2=\"f\",\"Madame\",C2=\"m\",\"Monsieur\")","v":"Monsieur"},{"$f":"VLOOKUP(C2,$C$38:$D$39,2,FALSE)","v":"Monsieur"},"Marié(e)",{"$f":"IF(AND(C2=\"f\",OR(G2=\"Marié(e)\",G2=\"Divorcé(e)\")),\"Madame\",IF(AND(C2=\"f\",G2=\"Célibataire\"),\"Mademoiselle\",\"Monsieur\"))","v":"Monsieur"},{"$f":"_xlfn.IFS(C2=\"m\",\"Monsieur\",G2=\"Célibataire\",\"Mademoiselle\",C2<>\"m\",\"Madame\")","v":"Monsieur"},1030,{"$f":"VLOOKUP(J2,Applic2_consignes!$C$13:$D$18,2,FALSE)","v":"Schaerbeek"},"1966-01-17",{"$f":"DATEDIF(L2,TODAY(),\"y\")","v":57},{"$f":"IF(M2<25,\"A\",IF(M2<35,\"B\",IF(M2<45,\"C\",IF(M2<55,\"D\",\"E\"))))","v":"E"},{"$f":"_xlfn.IFS(M2<25,\"A\",M2<35,\"B\",M2<45,\"C\",M2<55,\"D\",M2>=55,\"E\")","v":"E"},null,"Informatique",{"$f":"VLOOKUP(Q2,Applic2_consignes!$C$34:$D$37,2,FALSE)","v":1900}]
["Bijoba","Jo","m",{"$f":"IF(C3=\"f\",\"Madame\",\"Monsieur\")","v":"Monsieur"},{"$f":"_xlfn.IFS(C3=\"f\",\"Madame\",C3=\"m\",\"Monsieur\")","v":"Monsieur"},{"$f":"VLOOKUP(C3,$C$38:$D$39,2,FALSE)","v":"Monsieur"},"Marié(e)","Monsieur",{"$f":"_xlfn.IFS(C3=\"m\",\"Monsieur\",G3=\"Célibataire\",\"Mademoiselle\",C3<>\"m\",\"Madame\")","v":"Monsieur"},1000,{"$f":"VLOOKUP(J3,Applic2_consignes!$C$13:$D$18,2,FALSE)","v":"Bruxelles"},"1996-03-15",{"$f":"DATEDIF(L3,TODAY(),\"y\")","v":27},{"$f":"IF(M3<25,\"A\",IF(M3<35,\"B\",IF(M3<45,\"C\",IF(M3<55,\"D\",\"E\"))))","v":"B"},{"$f":"_xlfn.IFS(M3<25,\"A\",M3<35,\"B\",M3<45,\"C\",M3<55,\"D\",M3>=55,\"E\")","v":"B"},null,"Direction",{"$f":"VLOOKUP(Q3,Applic2_consignes!$C$34:$D$37,2,FALSE)","v":2500}]
["Covert","Harry","m","Monsieur",{"$f":"_xlfn.IFS(C4=\"f\",\"Madame\",C4=\"m\",\"Monsieur\")","v":"Monsieur"},"Monsieur","Divorcé(e)","Monsieur",{"$f":"_xlfn.IFS(C4=\"m\",\"Monsieur\",G4=\"Célibataire\",\"Mademoiselle\",C4<>\"m\",\"Madame\")","v":"Monsieur"},1000,{"$f":"VLOOKUP(J4,Applic2_consignes!$C$13:$D$18,2,FALSE)","v":"Bruxelles"},"2000-02-10",23,"A",{"$f":"_xlfn.IFS(M4<25,\"A\",M4<35,\"B\",M4<45,\"C\",M4<55,\"D\",M4>=55,\"E\")","v":"A"},null,"Personnel",{"$f":"VLOOKUP(Q4,Applic2_consignes!$C$34:$D$37,2,FALSE)","v":1600}]
["Culaire","Laury","m","Monsieur",{"$f":"_xlfn.IFS(C5=\"f\",\"Madame\",C5=\"m\",\"Monsieur\")","v":"Monsieur"},"Monsieur","Marié(e)","Monsieur",{"$f":"_xlfn.IFS(C5=\"m\",\"Monsieur\",G5=\"Célibataire\",\"Mademoiselle\",C5<>\"m\",\"Madame\")","v":"Monsieur"},1030,{"$f":"VLOOKUP(J5,Applic2_consignes!$C$13:$D$18,2,FALSE)","v":"Schaerbeek"},"1965-05-05",58,"E",{"$f":"_xlfn.IFS(M5<25,\"A\",M5<35,\"B\",M5<45,\"C\",M5<55,\"D\",M5>=55,\"E\")","v":"E"},null,"Personnel",{"$f":"VLOOKUP(Q5,Applic2_consignes!$C$34:$D$37,2,FALSE)","v":1600}]
["Deuf","John","m","Monsieur",{"$f":"_xlfn.IFS(C6=\"f\",\"Madame\",C6=\"m\",\"Monsieur\")","v":"Monsieur"},"Monsieur","Célibataire","Monsieur",{"$f":"_xlfn.IFS(C6=\"m\",\"Monsieur\",G6=\"Célibataire\",\"Mademoiselle\",C6<>\"m\",\"Madame\")","v":"Monsieur"},1070,{"$f":"VLOOKUP(J6,Applic2_consignes!$C$13:$D$18,2,FALSE)","v":"Anderlecht"},"1993-09-08",29,"B",{"$f":"_xlfn.IFS(M6<25,\"A\",M6<35,\"B\",M6<45,\"C\",M6<55,\"D\",M6>=55,\"E\")","v":"B"},null,"Informatique",{"$f":"VLOOKUP(Q6,Applic2_consignes!$C$34:$D$37,2,FALSE)","v":1900}]
["Foupasune","Jean","m","Monsieur",{"$f":"_xlfn.IFS(C7=\"f\",\"Madame\",C7=\"m\",\"Monsieur\")","v":"Monsieur"},"Monsieur","Célibataire","Monsieur",{"$f":"_xlfn.IFS(C7=\"m\",\"Monsieur\",G7=\"Célibataire\",\"Mademoiselle\",C7<>\"m\",\"Madame\")","v":"Monsieur"},1070,{"$f":"VLOOKUP(J7,Applic2_consignes!$C$13:$D$18,2,FALSE)","v":"Anderlecht"},"1975-08-07",47,"D",{"$f":"_xlfn.IFS(M7<25,\"A\",M7<35,\"B\",M7<45,\"C\",M7<55,\"D\",M7>=55,\"E\")","v":"D"},null,"Personnel",{"$f":"VLOOKUP(Q7,Applic2_consignes!$C$34:$D$37,2,FALSE)","v":1600}]
["Lairbon","Oussama","m","Monsieur",{"$f":"_xlfn.IFS(C8=\"f\",\"Madame\",C8=\"m\",\"Monsieur\")","v":"Monsieur"},"Monsieur","Marié(e)","Monsieur",{"$f":"_xlfn.IFS(C8=\"m\",\"Monsieur\",G8=\"Célibataire\",\"Mademoiselle\",C8<>\"m\",\"Madame\")","v":"Monsieur"},1030,{"$f":"VLOOKUP(J8,Applic2_consignes!$C$13:$D$18,2,FALSE)","v":"Schaerbeek"},"1983-02-08",40,"C",{"$f":"_xlfn.IFS(M8<25,\"A\",M8<35,\"B\",M8<45,\"C\",M8<55,\"D\",M8>=55,\"E\")","v":"C"},null,"Personnel",{"$f":"VLOOKUP(Q8,Applic2_consignes!$C$34:$D$37,2,FALSE)","v":1600}]
{"$rows_left_out":66}
{"sheet":"Applic3","index":6,"n_rows":28,"n_cols":13,"rows_kept":28,"cut":false,"hidden":false,"merged":[]}
[null,null,null,null,null,null,null,null,null,null,null,null,"Retour sommaire"]
[]
[null,"Lors de l'utilisation des 'SI' imbriqués, nous ne disposons que de 8 'SI'. Si les tranches été différentes (cf. ci-dessous), le problème n'aurait pas pu être résolu avec des 'SI' "]
[null,"Ce genre de problème peut être solutionné par l'utilisation d'une 'RechercheV' par valeur proche."]
[]
[]
[null,"Ages","Catégories",null,null,"Age","Catégories"]
[null,"<25","A",null,null,42]
{"$rows_left_out":21}
{"sheet":"Applic3_corrigé","index":7,"n_rows":28,"n_cols":7,"rows_kept":28,"cut":false,"hidden":true,"merged":[]}
[]
[]
[null,"Lors de l'utilisation des 'SI' imbriqués, nous ne disposons que de 8 'SI'. Si les tranches été différentes (cf. ci-dessous), le problème n'aurait pas pu être résolu avec des 'SI' "]
[null,"Ce genre de problème peut être solutionné par l'utilisation d'une 'RechercheV' par valeur proche."]
[]
[]
[null,"Ages",null,"Catégories",null,"Age","Catégories"]
[null,"<25",0,"A",null,42,{"$f":"VLOOKUP(F8,$C$8:$D$18,2,TRUE)","v":"E"}]
{"$rows_left_out":21}
{"sheet":"Applic4","index":8,"n_rows":29,"n_cols":13,"rows_kept":29,"cut":false,"hidden":false,"merged":[]}
["Nom","Prénom","Sexe","Etat civil","Ville","CP\n(Equiv)","CP\n(Index)","CP\n(RechercheX)",null,null,null,"Retour sommaire"]
["Bistrot","Alonso","m","Marié(e)","Schaerbeek"]
["Bijoba","Jo","m","Marié(e)","Bruxelles",null,null,null,null,"1)","Via la liste ci-dessous, choisir une personne et obtenir son état civil dans la cellule à côté"]
["Covert","Harry","m","Divorcé(e)","Bruxelles"]
["Culaire","Laury","m","Marié(e)","Schaerbeek",null,null,null,null,null,null,"Choix de la personne :","Covert"]
["Deuf","John","m","Célibataire","Anderlecht"]
["Foupasune","Jean","m","Célibataire","Anderlecht",null,null,null,null,null,null,"Son état civil :",{"$f":"VLOOKUP(M5,A2:D22,4,FALSE)","v":"Divorcé(e)"}]
["Lairbon","Oussama","m","Marié(e)","Schaerbeek"]
{"$rows_left_out":22}
{"sheet":"Applic4_corrigé","index":9,"n_rows":29,"n_cols":14,"rows_kept":29,"cut":false,"hidden":true,"merged":[]}
["Nom","Prénom","Nom & Prénom","Sexe","Etat civil","Ville","CP\n(Equiv)","CP\n(Index)","CP\n(RechercheX)",null,null,null,"Retour sommaire"]
["Bistrot","Alonso",{"$f":"A2&\" \"&B2","v":"Bistrot Alonso"},"m","Marié(e)","Schaerbeek",{"$f":"MATCH(F:F,$N$16:$N$21,0)","v":1},{"$f":"INDEX($M$16:$M$21,G2)","v":1030},{"$f":"_xlfn.XLOOKUP(F2,$N$16:$N$21,$M$16:$M$21,,0)","v":1030}]
["Bijoba","Jo",{"$f":"A3&\" \"&B3","v":"Bijoba Jo"},"m","Marié(e)","Bruxelles",{"$f":"MATCH(F:F,$N$16:$N$21,0)","v":2},{"$f":"INDEX($M$16:$M$21,G3)","v":1000},{"$f":"_xlfn.XLOOKUP(F3,$N$16:$N$21,$M$16:$M$21,,0)","v":1000},null,"1)","Via la liste ci-dessous, choisir une personne et obtenir son état civil dans la cellule à côté"]
["Covert","Harry","Covert Harry","m","Divorcé(e)","Bruxelles",2,{"$f":"INDEX($M$16:$M$21,G4)","v":1000},1000]
["Culaire","Laury","Culaire Laury","m","Marié(e)","Schaerbeek",1,{"$f":"INDEX($M$16:$M$21,G5)","v":1030},1030,null,null,null,"Choix de la personne :","Lalalalalalala Hutch"]
["Deuf","John","Deuf John","m","Célibataire","Anderlecht",3,{"$f":"INDEX($M$16:$M$21,G6)","v":1070},1070]
["Foupasune","Jean","Foupasune Jean","m","Célibataire","Anderlecht",3,{"$f":"INDEX($M$16:$M$21,G7)","v":1070},1070,null,null,null,"Son état civil :",{"$f":"VLOOKUP(N5,C2:E22,3,FALSE)","v":"Divorcé(e)"}]
["Lairbon","Oussama","Lairbon Oussama","m","Marié(e)","Schaerbeek",1,{"$f":"INDEX($M$16:$M$21,G8)","v":1030},1030]
{"$rows_left_out":22}
{"sheet":"Filtre1_corrigé","index":10,"n_rows":27,"n_cols":10,"rows_kept":27,"cut":false,"hidden":true,"merged":[]}
["Filtres automatiques"]
[]
["A l'aide des filtres automatiques, afficher les employés dont le nom commence par un 'p'"]
[]
[]
["Nom","Prénom","Sexe","Etat civil","Date de naissance","Age","Tranches","Services","Salaires Minimum","Salaires"]
["Bistrot","Alonso","m","Marié(e)","1966-01-17",{"$f":"DATEDIF(E7,TODAY(),\"y\")","v":57},{"$f":"IF(F7<25,0,IF(F7<35,1,IF(F7<45,2,IF(F7<55,3,4))))","v":4},"Informatique",{"$f":"VLOOKUP(H7,Applic2_consignes!$C$34:$D$37,2,FALSE)","v":1900},{"$f":"I7+5%*G7*I7","v":2280}]
["Bijoba","Jo","m","Marié(e)","1980-03-15",43,2,"Direction",{"$f":"VLOOKUP(H8,Applic2_consignes!$C$34:$D$37,2,FALSE)","v":2500},2750]
{"$rows_left_out":20}
{"sheet":"Filtre2_corrigé","index":11,"n_rows":27,"n_cols":10,"rows_kept":27,"cut":false,"hidden":true,"merged":[]}
["Filtres automatiques"]
[]
["A l'aide des filtres automatiques, afficher les employés du secrétariat et de la direction"]
[]
[]
["Nom","Prénom","Sexe","Etat civil","Date de naissance","Age","Tranches","Services","Salaires Minimum","Salaires"]
["Bistrot","Alonso","m","Marié(e)","1966-01-17",{"$f":"DATEDIF(E7,TODAY(),\"y\")","v":57},{"$f":"IF(F7<25,0,IF(F7<35,1,IF(F7<45,2,IF(F7<55,3,4))))","v":4},"Informatique",{"$f":"VLOOKUP(H7,Applic2_consignes!$C$34:$D$37,2,FALSE)","v":1900},{"$f":"I7+5%*G7*I7","v":2280}]
["Bijoba","Jo","m","Marié(e)","1980-03-15",43,2,"Direction",{"$f":"VLOOKUP(H8,Applic2_consignes!$C$34:$D$37,2,FALSE)","v":2500},2750]
{"$rows_left_out":20}
{"sheet":"Filtre3_corrigé","index":12,"n_rows":27,"n_cols":10,"rows_kept":27,"cut":false,"hidden":true,"merged":[]}
["Filtres automatiques"]
[]
["A l'aide des filtres automatiques, afficher les employés nés entre 1965 et 1975"]
[]
[]
["Nom","Prénom","Sexe","Etat civil","Date de naissance","Age","Tranches","Services","Salaires Minimum","Salaires"]
["Bistrot","Alonso","m","Marié(e)","1966-01-17",{"$f":"DATEDIF(E7,TODAY(),\"y\")","v":57},{"$f":"IF(F7<25,0,IF(F7<35,1,IF(F7<45,2,IF(F7<55,3,4))))","v":4},"Informatique",{"$f":"VLOOKUP(H7,Applic2_consignes!$C$34:$D$37,2,FALSE)","v":1900},{"$f":"I7+5%*G7*I7","v":2280}]
["Bijoba","Jo","m","Marié(e)","1980-03-15",43,2,"Direction",{"$f":"VLOOKUP(H8,Applic2_consignes!$C$34:$D$37,2,FALSE)","v":2500},2750]
{"$rows_left_out":20}
{"sheet":"Filtre4_corrigé","index":13,"n_rows":27,"n_cols":10,"rows_kept":27,"cut":false,"hidden":true,"merged":[]}
["Filtres automatiques"]
[]
["A l'aide des filtres automatiques, afficher les employés de l'informatique et de la direction nés entre 1965 et 1975"]
[]
[]
["Nom","Prénom","Sexe","Etat civil","Date de naissance","Age","Tranches","Services","Salaires Minimum","Salaires"]
["Bistrot","Alonso","m","Marié(e)","1966-01-17",{"$f":"DATEDIF(E7,TODAY(),\"y\")","v":57},{"$f":"IF(F7<25,0,IF(F7<35,1,IF(F7<45,2,IF(F7<55,3,4))))","v":4},"Informatique",{"$f":"VLOOKUP(H7,Applic2_consignes!$C$34:$D$37,2,FALSE)","v":1900},{"$f":"I7+5%*G7*I7","v":2280}]
["Bijoba","Jo","m","Marié(e)","1980-03-15",43,2,"Direction",{"$f":"VLOOKUP(H8,Applic2_consignes!$C$34:$D$37,2,FALSE)","v":2500},2750]
{"$rows_left_out":20}
{"sheet":"FiltreElab1_corrigé","index":14,"n_rows":12,"n_cols":11,"rows_kept":12,"cut":false,"hidden":true,"merged":[]}
[]
[]
["A l'aide des filtres élaborés, afficher les employés dont le nom commence par un 'p'"]
[]
[]
[null,"Nom"]
[null,"p"]
[]
{"$rows_left_out":5}
{"sheet":"FiltreElab2_corrigé","index":15,"n_rows":16,"n_cols":4,"rows_kept":16,"cut":false,"hidden":true,"merged":[]}
[]
[]
["A l'aide des filtres élaborés, afficher les nom, prénom et service des employés du secrétariat et de la direction"]
[]
[null,"Services"]
[null,"Secrétariat"]
[null,"Direction"]
[]
{"$rows_left_out":9}
{"sheet":"FiltreElab3_corrigé","index":16,"n_rows":18,"n_cols":11,"rows_kept":18,"cut":false,"hidden":true,"merged":[]}
[]
[]
["A l'aide des filtres élaborés, afficher les employés nés entre 1965 et 1975"]
[]
[]
[]
[null,"Date de naissance","Date de naissance"]
[null,">=1/1/1965","<1/1/1975"]
{"$rows_left_out":11}
{"sheet":"FiltreElab4_corrigé","index":17,"n_rows":14,"n_cols":11,"rows_kept":14,"cut":false,"hidden":true,"merged":[]}
[]
[]
["A l'aide des filtres élaborés, afficher les employés de l'informatique et de la direction nés entre 1965 et 1975"]
[]
[]
[null,"Date de naissance","Date de naissance","Services"]
[null,">=1/1/1965","<1/1/1975","informatique"]
[null,">=1/1/1965","<1/1/1975","direction"]
{"$rows_left_out":7}
{"sheet":"FiltreElab5_corrigé","index":18,"n_rows":27,"n_cols":10,"rows_kept":27,"cut":false,"hidden":true,"merged":[]}
[]
[]
["A l'aide des filtres élaborés, faites une extraction des données sans recopier les doublons"]
[]
[]
["Nom","Prénom","Sexe","Etat civil","Date de naissance","Age","Tranches","Services","Salaires Minimum","Salaires"]
["Bistrot","Alonso","m","Marié(e)","1966-01-17",42,2,"Informatique",1900,2090]
["Bijoba","Jo","m","Marié(e)","1980-03-15",28,1,"Direction",2500,2625]
{"$rows_left_out":20}
{"sheet":"FiltreElab6_corrigé","index":19,"n_rows":21,"n_cols":11,"rows_kept":21,"cut":false,"hidden":true,"merged":[]}
[]
[]
["A l'aide des filtres élaborés, afficher les employés dont l'âge est supérieur à la moyenne des âges"]
[]
[null,"Condition"]
[null,{"$f":"#REF!>AVERAGE(#REF!)","v":{"$error":"#REF!"}}]
[]
[]
{"$rows_left_out":14}
{"sheet":"Sous-Totaux1_corrigé","index":20,"n_rows":33,"n_cols":10,"rows_kept":33,"cut":false,"hidden":true,"merged":[]}
["Sous-Totaux"]
[]
["Utilisez les sous-totaux de façon à afficher le nombre d'employés par service."]
[]
[]
["Nom","Prénom","Sexe","Etat civil","Date de naissance","Age","Tranches","Services","Salaires Minimum","Salaires"]
["Bijoba","Jo","m","Marié(e)","1980-03-15",{"$f":"DATEDIF(E7,TODAY(),\"y\")","v":43},{"$f":"IF(F7<25,0,IF(F7<35,1,IF(F7<45,2,IF(F7<55,3,4))))","v":2},"Direction",{"$f":"VLOOKUP(H7,Applic2_consignes!$C$34:$D$37,2,FALSE)","v":2500},{"$f":"I7+5%*G7*I7","v":2750}]
["Lalalalalalala","Hutch","m","Divorcé(e)","1952-10-07",{"$f":"DATEDIF(E8,TODAY(),\"y\")","v":70},{"$f":"IF(F8<25,0,IF(F8<35,1,IF(F8<45,2,IF(F8<55,3,4))))","v":4},"Direction",{"$f":"VLOOKUP(H8,Applic2_consignes!$C$34:$D$37,2,FALSE)","v":2500},{"$f":"I8+5%*G8*I8","v":3000}]
{"$rows_left_out":26}
{"sheet":"Sous-Totaux2_corrigé","index":21,"n_rows":39,"n_cols":10,"rows_kept":39,"cut":false,"hidden":true,"merged":[]}
["Sous-Totaux"]
[]
["Utilisez les sous-totaux de façon à afficher le salaire moyen par service et par sexe."]
[]
[]
["Nom","Prénom","Sexe","Etat civil","Date de naissance","Age","Tranches","Services","Salaires Minimum","Salaires"]
["Zetofrais","Mélanie","f","Célibataire","1978-11-25",{"$f":"DATEDIF(E7,TODAY(),\"y\")","v":44},{"$f":"IF(F7<25,0,IF(F7<35,1,IF(F7<45,2,IF(F7<55,3,4))))","v":2},"Direction",{"$f":"VLOOKUP(H7,Applic2_consignes!$C$34:$D$37,2,FALSE)","v":2500},{"$f":"I7+5%*G7*I7","v":2750}]
[null,null,"Moyenne f",null,null,null,null,null,null,{"$f":"SUBTOTAL(1,J7:J7)","v":2750}]
{"$rows_left_out":32}
{"sheet":"Sous-Totaux3_corrigé","index":22,"n_rows":49,"n_cols":10,"rows_kept":49,"cut":false,"hidden":true,"merged":[]}
["Sous-Totaux"]
[]
["Utilisez les sous-totaux de façon à afficher le nombre d'employés et la moyenne des âges par sexe et par état civil."]
[]
[]
["Nom","Prénom","Sexe","Etat civil","Date de naissance","Age","Tranches","Services","Salaires Minimum","Salaires"]
["Zetofrais","Mélanie","f","Célibataire","1978-11-25",{"$f":"DATEDIF(E7,TODAY(),\"y\")","v":44},{"$f":"IF(F7<25,0,IF(F7<35,1,IF(F7<45,2,IF(F7<55,3,4))))","v":2},"Direction",{"$f":"VLOOKUP(H7,Applic2_consignes!$C$34:$D$37,2,FALSE)","v":2500},{"$f":"I7+5%*G7*I7","v":2750}]
[{"$f":"SUBTOTAL(3,A7:A7)","v":1},null,null,"Nombre Célibataire"]
{"$rows_left_out":42}
{"sheet":"Fonctions classiques_corrigé","index":23,"n_rows":28,"n_cols":15,"rows_kept":28,"cut":false,"hidden":true,"merged":[]}
["Utilisation des fonctions classiques",null,null,null,null,null,null,null,null,null,null,null,"Retour sommaire"]
[]
["Utilisez les fonctions classiques de façon à afficher le nombre d'employés par service."]
["Utilisez les fonctions classiques de façon à afficher le nombre d'employés et la moyenne des âges par sexe et par état civil."]
[]
["Nom","Prénom","Sexe","Etat civil","Date de naissance","Age","Tranches","Services","Salaires Minimum","Salaires"]
["Bistrot","Alonso","m","Marié(e)","1966-01-17",{"$f":"DATEDIF(E7,TODAY(),\"y\")","v":57},{"$f":"IF(F7<25,0,IF(F7<35,1,IF(F7<45,2,IF(F7<55,3,4))))","v":4},"Informatique",{"$f":"VLOOKUP(H7,Applic2_consignes!$C$34:$D$37,2,FALSE)","v":1900},{"$f":"I7+5%*G7*I7","v":2280},null,null,"Nombre d'employés par service"]
["Bijoba","Jo","m","Marié(e)","1980-03-15",43,2,"Direction",{"$f":"VLOOKUP(H8,Applic2_consignes!$C$34:$D$37,2,FALSE)","v":2500},2750]
{"$rows_left_out":21}
{"sheet":"TCD1_corrigé","index":24,"n_rows":14,"n_cols":3,"rows_kept":14,"cut":false,"hidden":true,"merged":[]}
[]
[]
["Utilisez les tableaux croisés dynamiques de façon à afficher le nombre d'employés par service."]
[]
[]
[]
[]
[null,"Nombre de Nom"]
{"$rows_left_out":7}
{"sheet":"TCD2_corrigé","index":25,"n_rows":13,"n_cols":5,"rows_kept":13,"cut":false,"hidden":true,"merged":[]}
[]
[]
["Utilisez les tableaux croisés dynamiques de façon à afficher le salaire moyen par service et par sexe."]
[]
[]
[]
[null,"Moyenne de Salaires","Sexe"]
[null,"Services","f","m","Total général"]
{"$rows_left_out":6}
{"sheet":"TCD3_corrigé","index":26,"n_rows":14,"n_cols":6,"rows_kept":14,"cut":false,"hidden":true,"merged":[]}
[]
[]
["Utilisez les tableaux croisés dynamiqes de façon à afficher le nombre d'employés et la moyenne des âges par sexe et par état civil."]
[]
[]
[]
[]
[null,null,"Sexe","Données"]
{"$rows_left_out":7}
{"sheet":"TCD4_corrigé","index":27,"n_rows":16,"n_cols":3,"rows_kept":16,"cut":false,"hidden":true,"merged":[]}
[]
[]
["Utilisez les tableaux croisés dynamiques de façon à afficher le nombre d'employés ayant un salaire compris entre 1600 et 1800, entre 1800 et 2000 et ainsi de suite jusque 3000."]
[]
[]
[]
[]
[null,"Nombre de Nom"]
{"$rows_left_out":9}
{"sheet":"TCD5_corrigé","index":28,"n_rows":22,"n_cols":3,"rows_kept":22,"cut":false,"hidden":true,"merged":[]}
[]
[]
["Afin d'établir un budget 'anniversaire', la société souhaite savoir quel est le nombre de personnes nées par mois."]
["Etablir un TCD fournissant ces rensigenements."]
[]
[]
[]
[null,"Nombre de Nom"]
{"$rows_left_out":15}
{"sheet":"TCD6_corrigé","index":29,"n_rows":14,"n_cols":4,"rows_kept":14,"cut":false,"hidden":true,"merged":[]}
[]
[]
["Créez un TCD donnant le pourcentage de femmes et d'hommes par service."]
["A partir de ça, créez un graphique croisé dynamique représentant ce pourcentage en 'histogramme'."]
[]
[]
[]
[null,"Nombre de Nom","Sexe"]
{"$rows_left_out":6}